Reaction Details
TargetDisintegrin and metalloproteinase domain-containing protein 17
LigandBDBM50104977
Substrate/Competitorn/a
Meas. Tech.ChEMBL_206141 (CHEMBL814098)
Ki 2.8±n/a nM
Citation Xue, CBHe, XCorbett, RLRoderick, JWasserman, ZRLiu, RQJaffee, BDCovington, MBQian, MTrzaskos, JMNewton, RCMagolda, RLWexler, RRDecicco, CP Discovery of macrocyclic hydroxamic acids containing biphenylmethyl derivatives at P1', a series of selective TNF-alpha converting enzyme inhibitors with potent cellular activity in the inhibition of TNF-alpha release. J Med Chem44:3351-4 (2001) Disintegrin and metalloproteinase domain-containing protein 17
Name:Disintegrin and metalloproteinase domain-containing protein 17
Type:Metalloprotease
Mol. Mass.:12197.99
Organism:Sus scrofa (pig)
Description:Partially purified TACE was obtained from porcine spleen.
Residue:112
BDBM50104977
NameBDBM50104977
Synonyms:11-(3',5'-Dichloro-biphenyl-4-ylmethyl)-2,10-dioxo-1-oxa-3,9-diaza-cyclopentadecane-8,12-dicarboxylic acid 12-hydroxyamide 8-[(2-morpholin-4-yl-2-oxo-ethyl)-amide] | CHEMBL324550
TypeSmall organic molecule
Emp. Form.C33H41Cl2N5O8
Mol. Mass.706.613
SMILESONC(=O)[C@H]1CCCOC(=O)NCCCC[C@H](NC(=O)[C@@H]1Cc1ccc(cc1)-c1cc(Cl)cc(Cl)c1)C(=O)NCC(=O)N1CCOCC1