Reaction Details
TargetDisintegrin and metalloproteinase domain-containing protein 17
LigandBDBM50104974
Substrate/Competitorn/a
Meas. Tech.ChEMBL_206141 (CHEMBL814098)
Ki 1.5±n/a nM
Citation Xue, CBHe, XCorbett, RLRoderick, JWasserman, ZRLiu, RQJaffee, BDCovington, MBQian, MTrzaskos, JMNewton, RCMagolda, RLWexler, RRDecicco, CP Discovery of macrocyclic hydroxamic acids containing biphenylmethyl derivatives at P1', a series of selective TNF-alpha converting enzyme inhibitors with potent cellular activity in the inhibition of TNF-alpha release. J Med Chem44:3351-4 (2001) Disintegrin and metalloproteinase domain-containing protein 17
Name:Disintegrin and metalloproteinase domain-containing protein 17
Type:Metalloprotease
Mol. Mass.:12197.99
Organism:Sus scrofa (pig)
Description:Partially purified TACE was obtained from porcine spleen.
Residue:112
BDBM50104974
NameBDBM50104974
Synonyms:2,10-Dioxo-11-(2'-trifluoromethyl-biphenyl-4-ylmethyl)-1-oxa-3,9-diaza-cyclopentadecane-8,12-dicarboxylic acid 8-carbamoylmethyl-amide 12-hydroxyamide | CHEMBL115263
TypeSmall organic molecule
Emp. Form.C30H36F3N5O7
Mol. Mass.635.6313
SMILESNC(=O)CNC(=O)[C@@H]1CCCCNC(=O)OCCC[C@@H]([C@@H](Cc2ccc(cc2)-c2ccccc2C(F)(F)F)C(=O)N1)C(=O)NO