Reaction Details
TargetEndothelin receptor type B
LigandBDBM50104982
Substrate/Competitorn/a
Meas. Tech.ChEMBL_63684 (CHEMBL670642)
IC50 7±n/a nM
Citation Morimoto, HShimadzu, HKushiyama, EKawanishi, HHosaka, TKawase, YYasuda, KKikkawa, KYamauchi-Kohno, RYamada, K Potent and selective ET-A antagonists. 1. Syntheses and structure-activity relationships of N-(6-(2-(aryloxy)ethoxy)-4-pyrimidinyl)sulfonamide derivatives. J Med Chem44:3355-68 (2001) Endothelin receptor type B
Name:Endothelin receptor type B
Type:Enzyme Catalytic Domain
Mol. Mass.:49664.00
Organism:Homo sapiens (Human)
Description:ENDOTHELIN B EDNRB HUMAN::P24530
Residue:442
BDBM50104982
NameBDBM50104982
Synonyms:CHEMBL175501 | sodium salt of 4-tert-Butyl-N-{6-[2-(5-furan-2-yl-pyrimidin-2-yloxy)-ethoxy]-5-p-tolyl-pyrimidin-4-yl}-benzenesulfonamide
TypeSmall organic molecule
Emp. Form.C31H30N5O5S
Mol. Mass.584.666
SMILESCc1ccc(cc1)-c1c([N-]S(=O)(=O)c2ccc(cc2)C(C)(C)C)ncnc1OCCOc1ncc(cn1)-c1ccco1