Reaction Details
TargetEndothelin-1 receptor
LigandBDBM50104988
Substrate/Competitorn/a
Meas. Tech.ChEMBL_65802 (CHEMBL679705)
IC50 0.036±n/a nM
Citation Morimoto, HShimadzu, HKushiyama, EKawanishi, HHosaka, TKawase, YYasuda, KKikkawa, KYamauchi-Kohno, RYamada, K Potent and selective ET-A antagonists. 1. Syntheses and structure-activity relationships of N-(6-(2-(aryloxy)ethoxy)-4-pyrimidinyl)sulfonamide derivatives. J Med Chem44:3355-68 (2001) Endothelin-1 receptor
Name:Endothelin-1 receptor
Type:PROTEIN
Mol. Mass.:48707.29
Organism:Sus scrofa
Description:ChEMBL_65803
Residue:427
BDBM50104988
NameBDBM50104988
Synonyms:4-tert-Butyl-N-{6-[2-(5-pyridin-2-yl-pyrimidin-2-yloxy)-ethoxy]-5-p-tolyl-pyrimidin-4-yl}-benzenesulfonamide; compound with methane | CHEMBL177173
TypeSmall organic molecule
Emp. Form.C32H32N6O4S
Mol. Mass.596.699
SMILESCc1ccc(cc1)-c1c(NS(=O)(=O)c2ccc(cc2)C(C)(C)C)ncnc1OCCOc1ncc(cn1)-c1ccccn1