Reaction Details
TargetEndothelin-1 receptor
LigandBDBM50105014
Substrate/Competitorn/a
Meas. Tech.ChEMBL_65802 (CHEMBL679705)
IC50 1±n/a nM
Citation Morimoto, HShimadzu, HKushiyama, EKawanishi, HHosaka, TKawase, YYasuda, KKikkawa, KYamauchi-Kohno, RYamada, K Potent and selective ET-A antagonists. 1. Syntheses and structure-activity relationships of N-(6-(2-(aryloxy)ethoxy)-4-pyrimidinyl)sulfonamide derivatives. J Med Chem44:3355-68 (2001) Endothelin-1 receptor
Name:Endothelin-1 receptor
Type:PROTEIN
Mol. Mass.:48707.29
Organism:Sus scrofa
Description:ChEMBL_65803
Residue:427
BDBM50105014
NameBDBM50105014
Synonyms:CHEMBL116220 | N-{6-[2-(5-Bromo-pyrimidin-2-yloxy)-ethoxy]-5-p-tolyl-pyrimidin-4-yl}-4-iodo-benzenesulfonamide
TypeSmall organic molecule
Emp. Form.C23H19BrIN5O4S
Mol. Mass.668.302
SMILESCc1ccc(cc1)-c1c(NS(=O)(=O)c2ccc(I)cc2)ncnc1OCCOc1ncc(Br)cn1