Reaction Details
TargetEndothelin-1 receptor
LigandBDBM50105037
Substrate/Competitorn/a
Meas. Tech.ChEMBL_65802 (CHEMBL679705)
IC50 8.8±n/a nM
Citation Morimoto, HShimadzu, HKushiyama, EKawanishi, HHosaka, TKawase, YYasuda, KKikkawa, KYamauchi-Kohno, RYamada, K Potent and selective ET-A antagonists. 1. Syntheses and structure-activity relationships of N-(6-(2-(aryloxy)ethoxy)-4-pyrimidinyl)sulfonamide derivatives. J Med Chem44:3355-68 (2001) Endothelin-1 receptor
Name:Endothelin-1 receptor
Type:PROTEIN
Mol. Mass.:48707.29
Organism:Sus scrofa
Description:ChEMBL_65803
Residue:427
BDBM50105037
NameBDBM50105037
Synonyms:4-tert-Butyl-N-{5-(3-methoxy-phenoxy)-6-[2-(pyridin-2-yloxy)-ethoxy]-pyrimidin-4-yl}-benzenesulfonamide | CHEMBL114105
TypeSmall organic molecule
Emp. Form.C28H30N4O6S
Mol. Mass.550.626
SMILESCOc1cccc(Oc2c(NS(=O)(=O)c3ccc(cc3)C(C)(C)C)ncnc2OCCOc2ccccn2)c1