Reaction Details
TargetEndothelin-1 receptor
LigandBDBM50105034
Substrate/Competitorn/a
Meas. Tech.ChEMBL_65802 (CHEMBL679705)
IC50 0.0017±n/a nM
Citation Morimoto, HShimadzu, HKushiyama, EKawanishi, HHosaka, TKawase, YYasuda, KKikkawa, KYamauchi-Kohno, RYamada, K Potent and selective ET-A antagonists. 1. Syntheses and structure-activity relationships of N-(6-(2-(aryloxy)ethoxy)-4-pyrimidinyl)sulfonamide derivatives. J Med Chem44:3355-68 (2001) Endothelin-1 receptor
Name:Endothelin-1 receptor
Type:PROTEIN
Mol. Mass.:48707.29
Organism:Sus scrofa
Description:ChEMBL_65803
Residue:427
BDBM50105034
NameBDBM50105034
Synonyms:4-tert-Butyl-N-{6-[2-(5-methoxy-pyrimidin-2-yloxy)-ethoxy]-5-p-tolyl-pyrimidin-4-yl}-benzenesulfonamide | CHEMBL113757
TypeSmall organic molecule
Emp. Form.C28H31N5O5S
Mol. Mass.549.641
SMILESCOc1cnc(OCCOc2ncnc(NS(=O)(=O)c3ccc(cc3)C(C)(C)C)c2-c2ccc(C)cc2)nc1