Reaction Details
TargetHeat shock protein HSP 90-alpha/90-beta
LigandBDBM50270588
Substrate/Competitorn/a
Meas. Tech.ChEMBL_2015034 (CHEMBL4668612)
Kd 20000±n/a nM
Citation Bancet, ARaingeval, CLomberget, TLe Borgne, MGuichou, JFKrimm, I Fragment Linking Strategies for Structure-Based Drug Design. J Med Chem63:11420-11435 (2020) 
 
Heat shock protein HSP 90-alpha/90-beta
Name:Heat shock protein HSP 90-alpha/90-beta
Type:n/a
Mol. Mass.:n/a
Description:ASSAY_ID of EBI is 29664
Components:This complex has 2 components.
Component 1
Name:Heat shock protein HSP 90-alpha
Synonyms:HS90A_HUMAN HSP86 HSP90AA1 HSPCA Heat shock 86 kDa Heat shock protein HSP 90-alpha (HSP90) LAP-2 Lipopolysaccharide-associated protein 2 heat shock protein 90kDa alpha (cytosolic), class A member 1 isoform 2
Type:Molecular Chaperone
Mol. Mass.:84623.45
Organism:Homo sapiens (Human)
Description:P07900
Residue:732
Component 2
Name:Heat shock protein HSP 90-beta
Synonyms:HS90B_HUMAN HSP 90 HSP90B HSPCB Heat shock protein HSP 90 (Hsp90)
Type:Molecular Chaperone
Mol. Mass.:83229.45
Organism:Homo sapiens (Human)
Description:P08238
Residue:724
BDBM50270588
NameBDBM50270588
Synonyms:4-METHYL-6-(TRIFLUOROMETHYL)PYRIMIDIN-2-AMINE HSP90 Inhibitor, 2 | hsp90_172
TypeSmall organic molecule
Emp. Form.C6H6F3N3
Mol. Mass.177.1271
SMILESCc1cc(nc(N)n1)C(F)(F)F