Reaction Details
TargetCalpain-1 catalytic subunit
LigandBDBM50105241
Substrate/Competitorn/a
Meas. Tech.ChEMBL_43496 (CHEMBL877099)
IC50 7±n/a nM
Citation Wells, GJTao, MJosef, KABihovsky, R 1,2-Benzothiazine 1,1-dioxide P(2)-P(3) peptide mimetic aldehyde calpain I inhibitors. J Med Chem44:3488-503 (2001) Calpain-1 catalytic subunit
Name:Calpain-1 catalytic subunit
Type:Protein
Mol. Mass.:81880.51
Organism:Homo sapiens (Human)
Description:n/a
Residue:714
BDBM50105241
NameBDBM50105241
Synonyms:6,7-Dichloro-2-methyl-1,1-dioxo-1,2,3,4-tetrahydro-1lambda*6*-benzo[e][1,2]thiazine-3-carboxylic acid (1-benzyl-2-oxo-ethyl)-amide | CHEMBL118688
TypeSmall organic molecule
Emp. Form.C19H18Cl2N2O4S
Mol. Mass.441.328
SMILESCN1C(Cc2cc(Cl)c(Cl)cc2S1(=O)=O)C(=O)N[C@@H](Cc1ccccc1)C=O