Reaction Details
TargetIntegrin alpha-4/beta-1
LigandBDBM50105410
Substrate/Competitorn/a
Meas. Tech.ChEMBL_214674 (CHEMBL821412)
IC50 0.360000±n/a nM
Citation Hagmann, WKDurette, PLLanza, TKevin, NJde Laszlo, SEKopka, IEYoung, DMagriotis, PALi, BLin, LSYang, GKamenecka, TChang, LLWilson, JMacCoss, MMills, SGVan Riper, GMcCauley, EEgger, LAKidambi, ULyons, KVincent, SStearns, RColletti, ATeffera, JTong, SFenyk-Melody, JOwens, KLevorse, DKim, PSchmidt, JAMumford, RA The discovery of sulfonylated dipeptides as potent VLA-4 antagonists. Bioorg Med Chem Lett11:2709-13 (2001) Integrin alpha-4/beta-1
Name:Integrin alpha-4/beta-1
Type:n/a
Mol. Mass.:n/a
Description:ASSAY_ID of EBI is 88912
Components:This complex has 2 components.
Component 1
Name:Integrin beta-1
Synonyms:CD_antigen=CD29 Fibronectin receptor beta GPIIA ITGB1 MDF2 | MSK12
Type:Enzyme
Mol. Mass.:88400.38
Organism:Homo sapiens (Human)
Description:P05556
Residue:798
Component 2
Name:Integrin alpha-4
Synonyms:CD49 antigen-like family member D CD49d antigen ITA4_HUMAN Integrin alpha-4 Integrin alpha-IV VLA-4 integrin alpha 4 precursor | integrin alpha-4 precursor
Type:Membrane Protein
Mol. Mass.:114897.35
Organism:Homo sapiens (Human)
Description:P13612
Residue:1032
BDBM50105410
NameBDBM50105410
Synonyms:(S)-2-{[(S)-1-(3,5-Dichloro-benzenesulfonyl)-pyrrolidine-2-carbonyl]-amino}-3-(2'-methylsulfanyl-biphenyl-4-yl)-propionic acid | CHEMBL329900
TypeSmall organic molecule
Emp. Form.C27H26Cl2N2O5S2
Mol. Mass.593.542
SMILESCSc1ccccc1-c1ccc(C[C@H](NC(=O)[C@@H]2CCCN2S(=O)(=O)c2cc(Cl)cc(Cl)c2)C(O)=O)cc1