Reaction Details
TargetIntegrin alpha-4/beta-7
LigandBDBM50105372
Substrate/Competitorn/a
Meas. Tech.ChEMBL_217605 (CHEMBL821055)
IC50 14±n/a nM
Citation Hagmann, WKDurette, PLLanza, TKevin, NJde Laszlo, SEKopka, IEYoung, DMagriotis, PALi, BLin, LSYang, GKamenecka, TChang, LLWilson, JMacCoss, MMills, SGVan Riper, GMcCauley, EEgger, LAKidambi, ULyons, KVincent, SStearns, RColletti, ATeffera, JTong, SFenyk-Melody, JOwens, KLevorse, DKim, PSchmidt, JAMumford, RA The discovery of sulfonylated dipeptides as potent VLA-4 antagonists. Bioorg Med Chem Lett11:2709-13 (2001) Integrin alpha-4/beta-7
Name:Integrin alpha-4/beta-7
Type:Protein Complex
Mol. Mass.:n/a
Description:The assay uses stably transfected K562 cells expressing human alpha4beta7 integrin.
Components:This complex has 2 components.
Component 1
Name:Integrin alpha-4
Synonyms:CD49 antigen-like family member D CD49d antigen ITA4_HUMAN Integrin alpha-4 Integrin alpha-IV VLA-4 integrin alpha 4 precursor | integrin alpha-4 precursor
Type:Membrane Protein
Mol. Mass.:114897.35
Organism:Homo sapiens (Human)
Description:P13612
Residue:1032
Component 2
Name:Integrin beta-7
Synonyms:ITB7_HUMAN Integrin alpha-4/beta-7 Integrin beta7
Type:Membrane Protein
Mol. Mass.:86893.88
Organism:Homo sapiens (Human)
Description:P26010
Residue:798
BDBM50105372
NameBDBM50105372
Synonyms:(S)-2-{[(S)-1-(3,5-Dichloro-benzenesulfonyl)-2-methyl-azetidine-2-carbonyl]-amino}-3-(2',6'-dimethoxy-biphenyl-4-yl)-propionic acid | CHEMBL309823
TypeSmall organic molecule
Emp. Form.C28H28Cl2N2O7S
Mol. Mass.607.502
SMILESCOc1cccc(OC)c1-c1ccc(C[C@H](NC(=O)[C@]2(C)CCN2S(=O)(=O)c2cc(Cl)cc(Cl)c2)C(O)=O)cc1