Reaction Details
TargetAmine oxidase [flavin-containing] B
LigandBDBM50105416
Substrate/Competitorn/a
Meas. Tech.ChEBML_123926
IC50 3530±n/a nM
Citation Ling, LUrichuk, LJSloley, BDCoutts, RTBaker, GBShan, JJPang, PK Synthesis of N-propargylphenelzine and analogues as neuroprotective agents. Bioorg Med Chem Lett11:2715-7 (2001) Amine oxidase [flavin-containing] B
Name:Amine oxidase [flavin-containing] B
Type:Enzyme
Mol. Mass.:58469.65
Organism:Rattus norvegicus (rat)
Description:P19643
Residue:520
BDBM50105416
NameBDBM50105416
Synonyms:CHEMBL328551 | N-((E)-3-Phenyl-allyl)-N-prop-2-ynyl-hydrazine
TypeSmall organic molecule
Emp. Form.C12H14N2
Mol. Mass.186.253
SMILESNN(C\C=C\c1ccccc1)CC#C