Reaction Details
TargetAmine oxidase [flavin-containing] B
LigandBDBM50105419
Substrate/Competitorn/a
Meas. Tech.ChEBML_123926
IC50 10200±n/a nM
Citation Ling, LUrichuk, LJSloley, BDCoutts, RTBaker, GBShan, JJPang, PK Synthesis of N-propargylphenelzine and analogues as neuroprotective agents. Bioorg Med Chem Lett11:2715-7 (2001) Amine oxidase [flavin-containing] B
Name:Amine oxidase [flavin-containing] B
Type:Enzyme
Mol. Mass.:58469.65
Organism:Rattus norvegicus (rat)
Description:P19643
Residue:520
BDBM50105419
NameBDBM50105419
Synonyms:CHEMBL328113 | N-((E)-3-Phenyl-allyl)-N'-prop-2-ynyl-hydrazine
TypeSmall organic molecule
Emp. Form.C12H14N2
Mol. Mass.186.253
SMILESC#CCNNC\C=C\c1ccccc1