Reaction Details
TargetAmine oxidase [flavin-containing] B
LigandBDBM50105420
Substrate/Competitorn/a
Meas. Tech.ChEBML_123926
IC50 3180±n/a nM
Citation Ling, LUrichuk, LJSloley, BDCoutts, RTBaker, GBShan, JJPang, PK Synthesis of N-propargylphenelzine and analogues as neuroprotective agents. Bioorg Med Chem Lett11:2715-7 (2001) Amine oxidase [flavin-containing] B
Name:Amine oxidase [flavin-containing] B
Type:Enzyme
Mol. Mass.:58469.65
Organism:Rattus norvegicus (rat)
Description:P19643
Residue:520
BDBM50105420
NameBDBM50105420
Synonyms:CHEMBL90653 | N-Phenethyl-N'-prop-2-ynyl-hydrazine
TypeSmall organic molecule
Emp. Form.C11H14N2
Mol. Mass.174.2423
SMILESC#CCNNCCc1ccccc1