Reaction Details
TargetAmine oxidase [flavin-containing] A
LigandBDBM50105422
Substrate/Competitorn/a
Meas. Tech.ChEBML_124429
IC50 11300±n/a nM
Citation Ling, LUrichuk, LJSloley, BDCoutts, RTBaker, GBShan, JJPang, PK Synthesis of N-propargylphenelzine and analogues as neuroprotective agents. Bioorg Med Chem Lett11:2715-7 (2001) Amine oxidase [flavin-containing] A
Name:Amine oxidase [flavin-containing] A
Type:Enzyme
Mol. Mass.:59515.21
Organism:Rattus norvegicus (rat)
Description:n/a
Residue:526
BDBM50105422
NameBDBM50105422
Synonyms:CHEMBL328446 | N-Phenyl-N-prop-2-ynyl-hydrazine
TypeSmall organic molecule
Emp. Form.C9H10N2
Mol. Mass.146.1891
SMILESNN(CC#C)c1ccccc1