Reaction Details
Target5-hydroxytryptamine receptor 4
LigandBDBM50105648
Substrate/Competitorn/a
Meas. Tech.ChEMBL_3346 (CHEMBL619046)
Ki 2.2±n/a nM
Citation López-Rodríguez, MLMurcia, MBenhamú, BViso, ACampillo, MPardo, L 3-D-QSAR/CoMFA and recognition models of benzimidazole derivatives at the 5-HT(4) receptor. Bioorg Med Chem Lett11:2807-11 (2001) 5-hydroxytryptamine receptor 4
Name:5-hydroxytryptamine receptor 4
Type:Enzyme Catalytic Domain
Mol. Mass.:46117.31
Organism:RAT
Description:5-HT4 HTR4 RAT::Q62758
Residue:406
BDBM50105648
NameBDBM50105648
Synonyms:6-Chloro-1-methyl-1H-benzoimidazole-4-carboxylic acid (1-isobutyl-piperidin-4-ylmethyl)-amide | CHEMBL97594
TypeSmall organic molecule
Emp. Form.C19H27ClN4O
Mol. Mass.362.897
SMILESCC(C)CN1CCC(CNC(=O)c2cc(Cl)cc3n(C)cnc23)CC1