Reaction Details
TargetThyroid hormone receptor alpha
LigandBDBM50105668
Substrate/Competitorn/a
Meas. Tech.ChEBML_210485
Kd 240±n/a nM
Citation Yoshihara, HAApriletti, JWBaxter, JDScanlan, TS A designed antagonist of the thyroid hormone receptor. Bioorg Med Chem Lett11:2821-5 (2001) Thyroid hormone receptor alpha
Name:Thyroid hormone receptor alpha
Type:Receptor
Mol. Mass.:54818.00
Organism:Homo sapiens (Human)
Description:Recombinant hThR was obtained from nuclear extracts from SF9 cells infected with baculovirus vectors encoding for ThRalpha 1.
Residue:490
BDBM50105668
NameBDBM50105668
Synonyms:CHEMBL264527 | {4-[11-(Butyl-methyl-carbamoyl)-1-(4-hydroxy-3-isopropyl-phenyl)-undec-4-enyl]-3,5-dimethyl-phenoxy}-acetic acid
TypeSmall organic molecule
Emp. Form.C36H53NO5
Mol. Mass.579.8097
SMILESCCCCN(C)C(=O)CCCCCC\C=C/CCC(c1ccc(O)c(c1)C(C)C)c1c(C)cc(OCC(O)=O)cc1C