Reaction Details
TargetThyroid hormone receptor beta
LigandBDBM50105669
Substrate/Competitorn/a
Meas. Tech.ChEBML_210495
Kd 90±n/a nM
Citation Yoshihara, HAApriletti, JWBaxter, JDScanlan, TS A designed antagonist of the thyroid hormone receptor. Bioorg Med Chem Lett11:2821-5 (2001) Thyroid hormone receptor beta
Name:Thyroid hormone receptor beta
Type:Receptor
Mol. Mass.:52793.62
Organism:Homo sapiens (Human)
Description:Recombinant hThR was obtained from nuclear extracts from SF9 cells infected with baculovirus vectors encoding for ThRbeta 1.
Residue:461
BDBM50105669
NameBDBM50105669
Synonyms:CHEMBL97613 | {4-[1-(4-Hydroxy-3-isopropyl-phenyl)-but-3-enyl]-3,5-dimethyl-phenoxy}-acetic acid
TypeSmall organic molecule
Emp. Form.C23H28O4
Mol. Mass.368.466
SMILESCC(C)c1cc(ccc1O)C(CC=C)c1c(C)cc(OCC(O)=O)cc1C