Reaction Details
TargetThyroid hormone receptor beta
LigandBDBM50105667
Substrate/Competitorn/a
Meas. Tech.ChEBML_210495
Kd 3600±n/a nM
Citation Yoshihara, HAApriletti, JWBaxter, JDScanlan, TS A designed antagonist of the thyroid hormone receptor. Bioorg Med Chem Lett11:2821-5 (2001) Thyroid hormone receptor beta
Name:Thyroid hormone receptor beta
Type:Receptor
Mol. Mass.:52793.62
Organism:Homo sapiens (Human)
Description:Recombinant hThR was obtained from nuclear extracts from SF9 cells infected with baculovirus vectors encoding for ThRbeta 1.
Residue:461
BDBM50105667
NameBDBM50105667
Synonyms:CHEMBL98135 | {4-[4-Hydroxy-1-(4-hydroxy-3-isopropyl-phenyl)-butyl]-3,5-dimethyl-phenoxy}-acetic acid
TypeSmall organic molecule
Emp. Form.C23H30O5
Mol. Mass.386.4813
SMILESCC(C)c1cc(ccc1O)C(CCCO)c1c(C)cc(OCC(O)=O)cc1C