Reaction Details
TargetThyroid hormone receptor alpha
LigandBDBM50105669
Substrate/Competitorn/a
Meas. Tech.ChEBML_210485
Kd 430±n/a nM
Citation Yoshihara, HAApriletti, JWBaxter, JDScanlan, TS A designed antagonist of the thyroid hormone receptor. Bioorg Med Chem Lett11:2821-5 (2001) Thyroid hormone receptor alpha
Name:Thyroid hormone receptor alpha
Type:Receptor
Mol. Mass.:54818.00
Organism:Homo sapiens (Human)
Description:Recombinant hThR was obtained from nuclear extracts from SF9 cells infected with baculovirus vectors encoding for ThRalpha 1.
Residue:490
BDBM50105669
NameBDBM50105669
Synonyms:CHEMBL97613 | {4-[1-(4-Hydroxy-3-isopropyl-phenyl)-but-3-enyl]-3,5-dimethyl-phenoxy}-acetic acid
TypeSmall organic molecule
Emp. Form.C23H28O4
Mol. Mass.368.466
SMILESCC(C)c1cc(ccc1O)C(CC=C)c1c(C)cc(OCC(O)=O)cc1C