Reaction Details
TargetHistone deacetylase 1
LigandBDBM50105689
Substrate/Competitorn/a
Meas. Tech.ChEMBL_87851 (CHEMBL701991)
IC50 90±n/a nM
Citation Lavoie, RBouchain, GFrechette, SWoo, SHAbou-Khalil, ELeit, SFournel, MYan, PTTrachy-Bourget, MCBeaulieu, CLi, ZBesterman, JDelorme, D Design and synthesis of a novel class of histone deacetylase inhibitors. Bioorg Med Chem Lett11:2847-50 (2001) Histone deacetylase 1
Name:Histone deacetylase 1
Type:Enzyme
Mol. Mass.:55090.27
Organism:Homo sapiens (Human)
Description:Q13547
Residue:482
BDBM50105689
NameBDBM50105689
Synonyms:(E)-3-[4-(3,4-Dimethoxy-benzenesulfonylamino)-phenyl]-N-hydroxy-acrylamide 3-[4-(3,4-Dimethoxy-benzenesulfonylamino)-phenyl]-N-hydroxy-acrylamide US8796330, 90
TypeSmall organic molecule
Emp. Form.C17H18N2O6S
Mol. Mass.378.4
SMILESCOc1ccc(cc1OC)S(=O)(=O)Nc1ccc(\C=C\C(=O)NO)cc1