Reaction Details
TargetHistone deacetylase 1
LigandBDBM50105678
Substrate/Competitorn/a
Meas. Tech.ChEMBL_87851 (CHEMBL701991)
IC50 60±n/a nM
Citation Lavoie, RBouchain, GFrechette, SWoo, SHAbou-Khalil, ELeit, SFournel, MYan, PTTrachy-Bourget, MCBeaulieu, CLi, ZBesterman, JDelorme, D Design and synthesis of a novel class of histone deacetylase inhibitors. Bioorg Med Chem Lett11:2847-50 (2001) Histone deacetylase 1
Name:Histone deacetylase 1
Type:Enzyme
Mol. Mass.:55090.27
Organism:Homo sapiens (Human)
Description:Q13547
Residue:482
BDBM50105678
NameBDBM50105678
Synonyms:(E)-N-Hydroxy-3-[4-(4-methoxy-benzenesulfonylamino)-phenyl]-acrylamide N-Hydroxy-3-[4-(4-methoxy-benzenesulfonylamino)-phenyl]-acrylamide US8796330, 113
TypeSmall organic molecule
Emp. Form.C16H16N2O5S
Mol. Mass.348.374
SMILESCOc1ccc(cc1)S(=O)(=O)Nc1ccc(\C=C\C(=O)NO)cc1