Reaction Details
TargetHistone deacetylase 1
LigandBDBM50105686
Substrate/Competitorn/a
Meas. Tech.ChEMBL_205835 (CHEMBL810946)
EC50 12000±n/a nM
Citation Lavoie, RBouchain, GFrechette, SWoo, SHAbou-Khalil, ELeit, SFournel, MYan, PTTrachy-Bourget, MCBeaulieu, CLi, ZBesterman, JDelorme, D Design and synthesis of a novel class of histone deacetylase inhibitors. Bioorg Med Chem Lett11:2847-50 (2001) Histone deacetylase 1
Name:Histone deacetylase 1
Type:Enzyme
Mol. Mass.:55090.27
Organism:Homo sapiens (Human)
Description:Q13547
Residue:482
BDBM50105686
NameBDBM50105686
Synonyms:(E)-N-Hydroxy-3-[4-(toluene-3-sulfonylamino)-phenyl]-acrylamide N-hydroxy-3-(4-(3-methylphenylsulfonamido)phenyl)acrylamide | US8796330, 115
TypeSmall organic molecule
Emp. Form.C16H16N2O4S
Mol. Mass.332.374
SMILESCc1cccc(c1)S(=O)(=O)Nc1ccc(\C=C\C(=O)NO)cc1