Reaction Details
TargetCytochrome P450 2C8
LigandBDBM50105814
Substrate/Competitorn/a
Meas. Tech.ChEMBL_51527 (CHEMBL660387)
IC50 3000±n/a nM
Citation Ha-Duong, NTDijols, SMarques-Soares, CMinoletti, CDansette, PMMansuy, D Synthesis of sulfaphenazole derivatives and their use as inhibitors and tools for comparing the active sites of human liver cytochromes P450 of the 2C subfamily. J Med Chem44:3622-31 (2001) Cytochrome P450 2C8
Name:Cytochrome P450 2C8
Type:Protein
Mol. Mass.:55839.23
Organism:Homo sapiens (Human)
Description:P10632
Residue:490
BDBM50105814
NameBDBM50105814
Synonyms:4-Amino-N-(3-methyl-butyl)-N-(2-phenyl-2H-pyrazol-3-yl)-benzenesulfonamide | CHEMBL414238
TypeSmall organic molecule
Emp. Form.C20H24N4O2S
Mol. Mass.384.495
SMILESCC(C)CCN(c1ccnn1-c1ccccc1)S(=O)(=O)c1ccc(N)cc1