Reaction Details
TargetCytochrome P450 2C18
LigandBDBM50105812
Substrate/Competitorn/a
Meas. Tech.ChEMBL_51520 (CHEMBL660380)
IC50 5000±n/a nM
Citation Ha-Duong, NTDijols, SMarques-Soares, CMinoletti, CDansette, PMMansuy, D Synthesis of sulfaphenazole derivatives and their use as inhibitors and tools for comparing the active sites of human liver cytochromes P450 of the 2C subfamily. J Med Chem44:3622-31 (2001) Cytochrome P450 2C18
Name:Cytochrome P450 2C18
Type:PROTEIN
Mol. Mass.:55714.53
Organism:Homo sapiens (Human)
Description:ChEMBL_51520
Residue:490
BDBM50105812
NameBDBM50105812
Synonyms:3'-Nitro-biphenyl-4-sulfonic acid (2-phenyl-2H-pyrazol-3-yl)-amide | CHEMBL120426
TypeSmall organic molecule
Emp. Form.C21H16N4O4S
Mol. Mass.420.441
SMILES[O-][N+](=O)c1cccc(c1)-c1ccc(cc1)S(=O)(=O)Nc1ccnn1-c1ccccc1