Reaction Details
TargetD(3) dopamine receptor
LigandBDBM34141
Substrate/Competitorn/a
Meas. Tech.ChEMBL_62122 (CHEMBL673443)
Ki 80±n/a nM
Citation Russell, MGBaker, RJBarden, LBeer, MSBristow, LBroughton, HBKnowles, MMcAllister, GPatel, SCastro, JL N-Arylsulfonylindole derivatives as serotonin 5-HT(6) receptor ligands. J Med Chem44:3881-95 (2001) D(3) dopamine receptor
Name:D(3) dopamine receptor
Type:n/a
Mol. Mass.:44243.43
Organism:Homo sapiens (Human)
Description:n/a
Residue:400
BDBM34141
NameBDBM34141
Synonyms:CHEMBL76237 | MS-245
TypeSmall organic molecule
Emp. Form.C19H22N2O3S
Mol. Mass.358.455
SMILESCOc1ccc2n(cc(CCN(C)C)c2c1)S(=O)(=O)c1ccccc1