Reaction Details
Target5-hydroxytryptamine receptor 6
LigandBDBM50106246
Substrate/Competitorn/a
Meas. Tech.ChEMBL_3611 (CHEMBL618094)
Ki 3±n/a nM
Citation Russell, MGBaker, RJBarden, LBeer, MSBristow, LBroughton, HBKnowles, MMcAllister, GPatel, SCastro, JL N-Arylsulfonylindole derivatives as serotonin 5-HT(6) receptor ligands. J Med Chem44:3881-95 (2001) 5-hydroxytryptamine receptor 6
Name:5-hydroxytryptamine receptor 6
Type:G Protein-Coupled Receptor (GPCR)
Mol. Mass.:46968.43
Organism:Homo sapiens (Human)
Description:P50406
Residue:440
BDBM50106246
NameBDBM50106246
Synonyms:CHEMBL126340 | [1-Benzenesulfonyl-4-(2-dimethylamino-ethyl)-1H-indol-2-yl]-phenyl-methanone
TypeSmall organic molecule
Emp. Form.C25H24N2O3S
Mol. Mass.432.535
SMILESCN(C)CCc1cccc2n(c(cc12)C(=O)c1ccccc1)S(=O)(=O)c1ccccc1