Reaction Details
Target5-hydroxytryptamine receptor 7
LigandBDBM34141
Substrate/Competitorn/a
Meas. Tech.ChEMBL_3686 (CHEMBL620821)
Ki 1900±n/a nM
Citation Russell, MGBaker, RJBarden, LBeer, MSBristow, LBroughton, HBKnowles, MMcAllister, GPatel, SCastro, JL N-Arylsulfonylindole derivatives as serotonin 5-HT(6) receptor ligands. J Med Chem44:3881-95 (2001) 5-hydroxytryptamine receptor 7
Name:5-hydroxytryptamine receptor 7
Type:G Protein-Coupled Receptor (GPCR)
Mol. Mass.:53573.08
Organism:Homo sapiens (Human)
Description:P34969
Residue:479
BDBM34141
NameBDBM34141
Synonyms:CHEMBL76237 | MS-245
TypeSmall organic molecule
Emp. Form.C19H22N2O3S
Mol. Mass.358.455
SMILESCOc1ccc2n(cc(CCN(C)C)c2c1)S(=O)(=O)c1ccccc1