Reaction Details
Target5-hydroxytryptamine receptor 6
LigandBDBM50106248
Substrate/Competitorn/a
Meas. Tech.ChEMBL_3611 (CHEMBL618094)
Ki 7.2±n/a nM
Citation Russell, MGBaker, RJBarden, LBeer, MSBristow, LBroughton, HBKnowles, MMcAllister, GPatel, SCastro, JL N-Arylsulfonylindole derivatives as serotonin 5-HT(6) receptor ligands. J Med Chem44:3881-95 (2001) 5-hydroxytryptamine receptor 6
Name:5-hydroxytryptamine receptor 6
Type:G Protein-Coupled Receptor (GPCR)
Mol. Mass.:46968.43
Organism:Homo sapiens (Human)
Description:P50406
Residue:440
BDBM50106248
NameBDBM50106248
Synonyms:(4S,5S)-4-Dimethylamino-1-(toluene-4-sulfonyl)-1,3,4,5-tetrahydro-benzo[cd]indol-5-ol CHEMBL127411
TypeSmall organic molecule
Emp. Form.C20H22N2O3S
Mol. Mass.370.465
SMILESCN(C)[C@H]1Cc2cn(c3cccc([C@@H]1O)c23)S(=O)(=O)c1ccc(C)cc1