Reaction Details
Target5-hydroxytryptamine receptor 6
LigandBDBM50106267
Substrate/Competitorn/a
Meas. Tech.ChEMBL_3611 (CHEMBL618094)
Ki 12±n/a nM
Citation Russell, MGBaker, RJBarden, LBeer, MSBristow, LBroughton, HBKnowles, MMcAllister, GPatel, SCastro, JL N-Arylsulfonylindole derivatives as serotonin 5-HT(6) receptor ligands. J Med Chem44:3881-95 (2001) 5-hydroxytryptamine receptor 6
Name:5-hydroxytryptamine receptor 6
Type:G Protein-Coupled Receptor (GPCR)
Mol. Mass.:46968.43
Organism:Homo sapiens (Human)
Description:P50406
Residue:440
BDBM50106267
NameBDBM50106267
Synonyms:CHEMBL126374 | [2-(1-Benzenesulfonyl-5-methoxy-2-methyl-1H-indol-3-yl)-ethyl]-dimethyl-amine
TypeSmall organic molecule
Emp. Form.C20H24N2O3S
Mol. Mass.372.481
SMILESCOc1ccc2n(c(C)c(CCN(C)C)c2c1)S(=O)(=O)c1ccccc1