Reaction Details
Target5-hydroxytryptamine receptor 6
LigandBDBM50106270
Substrate/Competitorn/a
Meas. Tech.ChEMBL_3611 (CHEMBL618094)
Ki 8.3±n/a nM
Citation Russell, MGBaker, RJBarden, LBeer, MSBristow, LBroughton, HBKnowles, MMcAllister, GPatel, SCastro, JL N-Arylsulfonylindole derivatives as serotonin 5-HT(6) receptor ligands. J Med Chem44:3881-95 (2001) 5-hydroxytryptamine receptor 6
Name:5-hydroxytryptamine receptor 6
Type:G Protein-Coupled Receptor (GPCR)
Mol. Mass.:46968.43
Organism:Homo sapiens (Human)
Description:P50406
Residue:440
BDBM50106270
NameBDBM50106270
Synonyms:CHEMBL339741 | {2-[5-Methoxy-1-(thiophene-2-sulfonyl)-1H-indol-3-yl]-ethyl}-dimethyl-amine
TypeSmall organic molecule
Emp. Form.C17H20N2O3S2
Mol. Mass.364.482
SMILESCOc1ccc2n(cc(CCN(C)C)c2c1)S(=O)(=O)c1cccs1