Reaction Details
Target5-hydroxytryptamine receptor 1B
LigandBDBM50106249
Substrate/Competitorn/a
Meas. Tech.ChEMBL_1339 (CHEMBL616525)
Ki 11±n/a nM
Citation Russell, MGBaker, RJBarden, LBeer, MSBristow, LBroughton, HBKnowles, MMcAllister, GPatel, SCastro, JL N-Arylsulfonylindole derivatives as serotonin 5-HT(6) receptor ligands. J Med Chem44:3881-95 (2001) 5-hydroxytryptamine receptor 1B
Name:5-hydroxytryptamine receptor 1B
Type:G Protein-Coupled Receptor (GPCR)
Mol. Mass.:43579.17
Organism:Homo sapiens (Human)
Description:Receptor binding assays were performed using human clone stably expressed in CHO cells
Residue:390
BDBM50106249
NameBDBM50106249
Synonyms:CHEMBL92139 | [2-(1-Benzenesulfonyl-1H-indol-4-yl)-ethyl]-dimethyl-amine
TypeSmall organic molecule
Emp. Form.C18H20N2O2S
Mol. Mass.328.429
SMILESCN(C)CCc1cccc2n(ccc12)S(=O)(=O)c1ccccc1