Reaction Details
TargetInsulin-like growth factor-binding protein 1
LigandBDBM50106432
Substrate/Competitorn/a
Meas. Tech.ChEMBL_90401 (CHEMBL698356)
Ki 34±n/a nM
Citation Chen, CZhu, YFLiu, XJLu, ZXXie, QLing, N Discovery of a series of nonpeptide small molecules that inhibit the binding of insulin-like growth factor (IGF) to IGF-binding proteins. J Med Chem44:4001-10 (2001) Insulin-like growth factor-binding protein 1
Name:Insulin-like growth factor-binding protein 1
Type:PROTEIN
Mol. Mass.:27896.36
Organism:Homo sapiens (Human)
Description:ChEMBL_90401
Residue:259
BDBM50106432
NameBDBM50106432
Synonyms:(3,4-Dihydroxy-phenyl)-(3,6,7-trihydroxy-isoquinolin-1-yl)-methanone | CHEMBL130994
TypeSmall organic molecule
Emp. Form.C16H11NO6
Mol. Mass.313.2616
SMILESOc1ccc(cc1O)C(=O)c1[nH]c(=O)cc2cc(O)c(O)cc12