Reaction Details
TargetEstrogen receptor
LigandBDBM50444892
Substrate/Competitorn/a
Meas. Tech.ChEMBL_2016947 (CHEMBL4670525)
IC50 0.600000±n/a nM
Citation Cooper, LSchafer, ALi, YCheng, HMedegan Fagla, BShen, ZNowar, RDye, KAnantpadma, MDavey, RAThatcher, GRJRong, LXiong, R Screening and Reverse-Engineering of Estrogen Receptor Ligands as Potent Pan-Filovirus Inhibitors. J Med Chem63:11085-11099 (2020) 
 
Estrogen receptor
Name:Estrogen receptor
Type:Protein
Mol. Mass.:66230.44
Organism:Homo sapiens (Human)
Description:P03372
Residue:595
BDBM50444892
NameBDBM50444892
Synonyms:CHEMBL392916
TypeSmall organic molecule
Emp. Form.C34H42N2O2
Mol. Mass.510.7095
SMILES[#6]-[#6]\[#6](=[#6](\c1ccc(-[#8]-[#6]-[#6]-[#7]-2-[#6]-[#6]-[#6]-[#6]-2)cc1)-c1ccc(-[#8]-[#6]-[#6]-[#7]-2-[#6]-[#6]-[#6]-[#6]-2)cc1)-c1ccccc1