Reaction Details
TargetMethylated-DNA--protein-cysteine methyltransferase
LigandBDBM50106517
Substrate/Competitorn/a
Meas. Tech.ChEMBL_103719 (CHEMBL712287)
IC50 9.0±n/a nM
Citation Reinhard, JHull, WEvon der Lieth, CWEichhorn, UKliem, HCKaina, BWiessler, M Monosaccharide-linked inhibitors of O(6)-methylguanine-DNA methyltransferase (MGMT): synthesis, molecular modeling, and structure-activity relationships. J Med Chem44:4050-61 (2001) Methylated-DNA--protein-cysteine methyltransferase
Name:Methylated-DNA--protein-cysteine methyltransferase
Type:PROTEIN
Mol. Mass.:21651.27
Organism:Homo sapiens (Human)
Description:ChEMBL_144711
Residue:207
BDBM50106517
NameBDBM50106517
Synonyms:6-(4-Bromo-thiophen-2-ylmethoxy)-9H-purin-2-ylamine | CHEMBL339133
TypeSmall organic molecule
Emp. Form.C10H8BrN5OS
Mol. Mass.326.172
SMILESNc1nc(OCc2cc(Br)cs2)c2[nH]cnc2n1