Reaction Details
TargetMethylated-DNA--protein-cysteine methyltransferase
LigandBDBM50106518
Substrate/Competitorn/a
Meas. Tech.ChEMBL_103719 (CHEMBL712287)
IC50 30±n/a nM
Citation Reinhard, JHull, WEvon der Lieth, CWEichhorn, UKliem, HCKaina, BWiessler, M Monosaccharide-linked inhibitors of O(6)-methylguanine-DNA methyltransferase (MGMT): synthesis, molecular modeling, and structure-activity relationships. J Med Chem44:4050-61 (2001) Methylated-DNA--protein-cysteine methyltransferase
Name:Methylated-DNA--protein-cysteine methyltransferase
Type:PROTEIN
Mol. Mass.:21651.27
Organism:Homo sapiens (Human)
Description:ChEMBL_144711
Residue:207
BDBM50106518
NameBDBM50106518
Synonyms:2-{10-[2-Amino-6-(4-bromo-thiophen-2-ylmethoxy)-purin-9-yl]-decyloxy}-6-hydroxymethyl-tetrahydro-pyran-3,4,5-triol | CHEMBL131510
TypeSmall organic molecule
Emp. Form.C26H38BrN5O7S
Mol. Mass.644.578
SMILESNc1nc(OCc2cc(Br)cs2)c2ncn(CCCCCCCCCCO[C@H]3OC(CO)[C@@H](O)[C@@H](O)C3O)c2n1