Reaction Details
TargetTranscriptional enhancer factor TEF-3
LigandBDBM85507
Substrate/Competitorn/a
Meas. Tech.ChEMBL_2017235 (CHEMBL4670813)
IC50 41900±n/a nM
Citation Karatas, HAkbarzadeh, MAdihou, HHahne, GPobbati, AVYihui Ng, EGuéret, SMSievers, SPahl, AMetz, MZinken, SDötsch, LNowak, CThavam, SFriese, AKang, CHong, WWaldmann, H Discovery of Covalent Inhibitors Targeting the Transcriptional Enhanced Associate Domain Central Pocket. J Med Chem63:11972-11989 (2020) 
 
Transcriptional enhancer factor TEF-3
Name:Transcriptional enhancer factor TEF-3
Type:PROTEIN
Mol. Mass.:48333.01
Organism:Homo sapiens
Description:ChEMBL_118073
Residue:434
BDBM85507
NameBDBM85507
Synonyms:CAS_4394-00-7 Niflumic acid US10278929, Niflumic acid US20240002326, Compound Niflumic acid
TypeSmall organic molecule
Emp. Form.C13H9F3N2O2
Mol. Mass.282.218
SMILESOC(=O)c1cccnc1Nc1cccc(c1)C(F)(F)F