Reaction Details
TargetIntermediate conductance calcium-activated potassium channel protein 4
LigandBDBM50547899
Substrate/Competitorn/a
Meas. Tech.ChEMBL_2019386 (CHEMBL4672964)
IC50 24±n/a nM
Citation Blass, BE Novel Potassium Channel Inhibitors. ACS Med Chem Lett11:2357-2358 (2020) 
 
Intermediate conductance calcium-activated potassium channel protein 4
Name:Intermediate conductance calcium-activated potassium channel protein 4
Type:PROTEIN
Mol. Mass.:47723.22
Organism:Homo sapiens (Human)
Description:ChEMBL_1361891
Residue:427
BDBM50547899
NameBDBM50547899
Synonyms:CHEMBL4764429 | US20240034717, Example 31.39
TypeSmall organic molecule
Emp. Form.C17H23F3N2
Mol. Mass.312.3731
SMILESCC(C)(N)CN(C1CC1)C1(CC1)c1cccc(c1)C(F)(F)F