Reaction Details
TargetIntermediate conductance calcium-activated potassium channel protein 4
LigandBDBM50547906
Substrate/Competitorn/a
Meas. Tech.ChEMBL_2019386 (CHEMBL4672964)
IC50 52±n/a nM
Citation Blass, BE Novel Potassium Channel Inhibitors. ACS Med Chem Lett11:2357-2358 (2020) 
 
Intermediate conductance calcium-activated potassium channel protein 4
Name:Intermediate conductance calcium-activated potassium channel protein 4
Type:PROTEIN
Mol. Mass.:47723.22
Organism:Homo sapiens (Human)
Description:ChEMBL_1361891
Residue:427
BDBM50547906
NameBDBM50547906
Synonyms:CHEMBL4743839 | US20240034717, Example 31.63
TypeSmall organic molecule
Emp. Form.C18H22F4N2O2
Mol. Mass.374.3731
SMILESCCOC(=O)N(C[C@@H]1CCCN1)C1(CC1)c1ccc(F)c(c1)C(F)(F)F