Reaction Details
TargetSodium-dependent serotonin transporter
LigandBDBM50006774
Substrate/Competitorn/a
Meas. Tech.ChEBML_201799
Ki 0.460000±n/a nM
Citation Gu, XHZong, RKula, NSBaldessarini, RJNeumeyer, JL Synthesis and biological evaluation of a series of novel N- or O-fluoroalkyl derivatives of tropane: potential positron emission tomography (PET) imaging agents for the dopamine transporter. Bioorg Med Chem Lett11:3049-53 (2001) Sodium-dependent serotonin transporter
Name:Sodium-dependent serotonin transporter
Type:Multi-pass membrane protein
Mol. Mass.:70168.43
Organism:Rattus norvegicus (rat)
Description:P31652
Residue:630
BDBM50006774
NameBDBM50006774
Synonyms:(2S,3S)-methyl 3-(4-iodophenyl)-8-methyl-8-aza-bicyclo[3.2.1]octane-2-carboxylate CHEMBL311347 | methyl 3-(4-iodophenyl)-8-methyl-(2S,3S)-8-azabicyclo[3.2.1]octane-2-carboxylate
TypeSmall organic molecule
Emp. Form.C16H20INO2
Mol. Mass.385.24
SMILESCOC(=O)[C@@H]1C2CC[C@H](C[C@@H]1c1ccc(I)cc1)N2C