Reaction Details
TargetSodium-dependent dopamine transporter
LigandBDBM50106857
Substrate/Competitorn/a
Meas. Tech.ChEBML_62323
Ki 0.640000±n/a nM
Citation Gu, XHZong, RKula, NSBaldessarini, RJNeumeyer, JL Synthesis and biological evaluation of a series of novel N- or O-fluoroalkyl derivatives of tropane: potential positron emission tomography (PET) imaging agents for the dopamine transporter. Bioorg Med Chem Lett11:3049-53 (2001) Sodium-dependent dopamine transporter
Name:Sodium-dependent dopamine transporter
Type:Multi-pass membrane protein
Mol. Mass.:68749.45
Organism:Rattus norvegicus (rat)
Description:P23977
Residue:619
BDBM50106857
NameBDBM50106857
Synonyms:3-(4-Iodo-phenyl)-8-aza-bicyclo[3.2.1]octane-2-carboxylic acid methyl ester | CHEMBL14613
TypeSmall organic molecule
Emp. Form.C15H18INO2
Mol. Mass.371.2134
SMILESCOC(=O)C1C2CCC(CC1c1ccc(I)cc1)N2