Reaction Details
TargetD(2) dopamine receptor
LigandBDBM21398
Substrate/Competitorn/a
Meas. Tech.ChEMBL_62392 (CHEMBL672344)
Ki 0.8±n/a nM
Citation Perrone, RBerardi, FColabufo, NALeopoldo, MLacivita, ETortorella, VLeonardi, APoggesi, ETesta, R trans-4-[4-(Methoxyphenyl)cyclohexyl]-1-arylpiperazines: a new class of potent and selective 5-HT(1A) receptor ligands as conformationally constrained analogues of 4-[3-(5-methoxy-1,2,3,4-tetrahydronaphthalen-1-yl)propyl]-1-arylpiperazines. J Med Chem44:4431-42 (2001) D(2) dopamine receptor
Name:D(2) dopamine receptor
Type:G Protein-Coupled Receptor (GPCR)
Mol. Mass.:50931.60
Organism:Rattus norvegicus (rat)
Description:P61169
Residue:444
BDBM21398
NameBDBM21398
Synonyms:4-[4-(4-Chloro-phenyl)-4-hydroxy-piperidin-1-yl]-1-(4-fluoro-phenyl)-butan-1-one;propionate(HCl) CHEMBL54 Haloperidol | Haloperidol, 1
TypeSmall organic molecule
Emp. Form.C21H23ClFNO2
Mol. Mass.375.864
SMILESOC1(CCN(CCCC(=O)c2ccc(F)cc2)CC1)c1ccc(Cl)cc1