Reaction Details
TargetGhrelin O-acyltransferase
LigandBDBM50548079
Substrate/Competitorn/a
Meas. Tech.ChEMBL_2019861 (CHEMBL4673674)
IC50 0.066000±n/a nM
Citation Iyer, MRWood, CMKunos, G Recent progress in the discovery of ghrelin  RSC Med Chem11:1136-1144 (2020) 
 
Ghrelin O-acyltransferase
Name:Ghrelin O-acyltransferase
Type:Enzyme
Mol. Mass.:49733.10
Organism:Homo sapiens (Human)
Description:Q96T53
Residue:435
BDBM50548079
NameBDBM50548079
Synonyms:CHEMBL4754865
TypeSmall organic molecule
Emp. Form.C15H13F3N4O2
Mol. Mass.338.2845
SMILESCOc1cc(ccc1Cc1c(C)nc2nonc2c1N)C(F)(F)F