Reaction Details
TargetGhrelin O-acyltransferase
LigandBDBM396236
Substrate/Competitorn/a
Meas. Tech.ChEMBL_2019861 (CHEMBL4673674)
IC50 0.020000±n/a nM
Citation Iyer, MRWood, CMKunos, G Recent progress in the discovery of ghrelin  RSC Med Chem11:1136-1144 (2020) 
 
Ghrelin O-acyltransferase
Name:Ghrelin O-acyltransferase
Type:Enzyme
Mol. Mass.:49733.10
Organism:Homo sapiens (Human)
Description:Q96T53
Residue:435
BDBM396236
NameBDBM396236
Synonyms:6-(7-Amino-5-methyl-[1,2,5]oxadiazolo[3,4-b]pyridin-6-ylmethyl)-2-cyclopropylamino-nicotinonitrile | US10308667, Example 139
TypeSmall organic molecule
Emp. Form.C16H15N7O
Mol. Mass.321.3366
SMILESCc1nc2nonc2c(N)c1Cc1ccc(C#N)c(NC2CC2)n1