Reaction Details
TargetEndothelin-1 receptor
LigandBDBM50107561
Substrate/Competitorn/a
Meas. Tech.ChEBML_65801
IC50 0.005300±n/a nM
Citation Morimoto, HShimadzu, HHosaka, TKawase, YYasuda, KKikkawa, KYamauchi-Kohno, RYamada, K Modifications and structure-activity relationships at the 2-position of 4-sulfonamidopyrimidine derivatives as potent endothelin antagonists. Bioorg Med Chem Lett12:81-4 (2001) Endothelin-1 receptor
Name:Endothelin-1 receptor
Type:PROTEIN
Mol. Mass.:48707.29
Organism:Sus scrofa
Description:ChEMBL_65803
Residue:427
BDBM50107561
NameBDBM50107561
Synonyms:CHEMBL168441 | N-[6-[2-(5-Bromo-pyrimidin-2-yloxy)-ethoxy]-2-(2-hydroxy-ethylamino)-5-(2-methoxy-phenoxy)-pyrimidin-4-yl]-4-tert-butyl-benzenesulfonamide
TypeSmall organic molecule
Emp. Form.C29H33BrN6O7S
Mol. Mass.689.577
SMILESCOc1ccccc1Oc1c(NS(=O)(=O)c2ccc(cc2)C(C)(C)C)nc(NCCO)nc1OCCOc1ncc(Br)cn1