Reaction Details
TargetMuscarinic acetylcholine receptor M1
LigandBDBM50107705
Substrate/Competitorn/a
Meas. Tech.ChEMBL_138270 (CHEMBL744227)
EC50 120±n/a nM
Citation Rajeswaran, WGCao, YHuang, XPWroblewski, MEColclough, TLee, SLiu, FNagy, PIEllis, JLevine, BANocka, KHMesser, WS Design, synthesis, and biological characterization of bivalent 1-methyl-1,2,5,6-tetrahydropyridyl-1,2,5-thiadiazole derivatives as selective muscarinic agonists. J Med Chem44:4563-76 (2001) Muscarinic acetylcholine receptor M1
Name:Muscarinic acetylcholine receptor M1
Type:Protein
Mol. Mass.:51442.54
Organism:Homo sapiens (Human)
Description:P11229
Residue:460
BDBM50107705
NameBDBM50107705
Synonyms:1,9-di[4-(1-methyl-1,2,3,6-tetrahydro-5-pyridinyl)-1,2,5-thiadiazol-3-ylsulfanyl]nonane | CHEMBL336933
TypeSmall organic molecule
Emp. Form.C25H38N6S4
Mol. Mass.550.869
SMILESCN1CCC=C(C1)c1nsnc1SCCCCCCCCCSc1nsnc1C1=CCCN(C)C1