Reaction Details
TargetMuscarinic acetylcholine receptor M4
LigandBDBM50107715
Substrate/Competitorn/a
Meas. Tech.ChEMBL_139105 (CHEMBL749229)
EC50 1.4±n/a nM
Citation Rajeswaran, WGCao, YHuang, XPWroblewski, MEColclough, TLee, SLiu, FNagy, PIEllis, JLevine, BANocka, KHMesser, WS Design, synthesis, and biological characterization of bivalent 1-methyl-1,2,5,6-tetrahydropyridyl-1,2,5-thiadiazole derivatives as selective muscarinic agonists. J Med Chem44:4563-76 (2001) Muscarinic acetylcholine receptor M4
Name:Muscarinic acetylcholine receptor M4
Type:Enzyme Catalytic Domain
Mol. Mass.:53079.31
Organism:Homo sapiens (Human)
Description:Cholinergic, muscarinic M4 CHRM4 HUMAN M3::P08173
Residue:479
BDBM50107715
NameBDBM50107715
Synonyms:1,12-di[4-(1-methyl-1,2,3,6-tetrahydro-5-pyridinyl)-1,2,5-thiadiazol-3-yloxy]dodecane | CHEMBL142538
TypeSmall organic molecule
Emp. Form.C28H44N6O2S2
Mol. Mass.560.818
SMILESCN1CCC=C(C1)c1nsnc1OCCCCCCCCCCCCOc1nsnc1C1=CCCN(C)C1