Reaction Details
Target5-hydroxytryptamine receptor 1A
LigandBDBM50107867
Substrate/Competitorn/a
Meas. Tech.ChEMBL_1110 (CHEMBL616055)
Ki 19.5±n/a nM
Citation Haadsma-Svensson, SRCleek, KADinh, DMDuncan, JNHaber, CLHuff, RMLajiness, MENichols, NFSmith, MWSvensson, KAZaya, MJCarlsson, ALin, CH Dopamine D(3) receptor antagonists. 1. Synthesis and structure-activity relationships of 5,6-dimethoxy-N-alkyl- and N-alkylaryl-substituted 2-aminoindans. J Med Chem44:4716-32 (2001) 5-hydroxytryptamine receptor 1A
Name:5-hydroxytryptamine receptor 1A
Type:G Protein-Coupled Receptor (GPCR)
Mol. Mass.:46445.29
Organism:Rattus norvegicus (rat)
Description:Binding assays were performed using rat hippocampal membranes.
Residue:422
BDBM50107867
NameBDBM50107867
Synonyms:(R)-2-Dipropylamino-indan-4-ol 2-Dipropylamino-indan-4-ol | CHEMBL85362
TypeSmall organic molecule
Emp. Form.C15H23NO
Mol. Mass.233.3492
SMILESCCCN(CCC)C1Cc2cccc(O)c2C1