Reaction Details
TargetD(3) dopamine receptor
LigandBDBM50107873
Substrate/Competitorn/a
Meas. Tech.ChEMBL_62758 (CHEMBL676127)
Ki 29±n/a nM
Citation Haadsma-Svensson, SRCleek, KADinh, DMDuncan, JNHaber, CLHuff, RMLajiness, MENichols, NFSmith, MWSvensson, KAZaya, MJCarlsson, ALin, CH Dopamine D(3) receptor antagonists. 1. Synthesis and structure-activity relationships of 5,6-dimethoxy-N-alkyl- and N-alkylaryl-substituted 2-aminoindans. J Med Chem44:4716-32 (2001) D(3) dopamine receptor
Name:D(3) dopamine receptor
Type:Protein
Mol. Mass.:49540.58
Organism:Rattus norvegicus (Rat)
Description:P19020
Residue:446
BDBM50107873
NameBDBM50107873
Synonyms:(5,6-Dimethoxy-indan-2-yl)-[2-(3,4-dimethoxy-phenyl)-ethyl]-propyl-amine | CHEMBL142056
TypeSmall organic molecule
Emp. Form.C24H33NO4
Mol. Mass.399.5231
SMILESCCCN(CCc1ccc(OC)c(OC)c1)C1Cc2cc(OC)c(OC)cc2C1