Reaction Details
TargetAdenosine receptor A2a
LigandBDBM50108019
Substrate/Competitorn/a
Meas. Tech.ChEMBL_31503 (CHEMBL647488)
Ki 0.19±n/a nM
Citation Baraldi, PGCacciari, BRomagnoli, RSpalluto, GMonopoli, AOngini, EVarani, KBorea, PA 7-Substituted 5-amino-2-(2-furyl)pyrazolo[4,3-e]-1,2,4-triazolo[1,5-c]pyrimidines as A2A adenosine receptor antagonists: a study on the importance of modifications at the side chain on the activity and solubility. J Med Chem45:115-26 (2001) Adenosine receptor A2a
Name:Adenosine receptor A2a
Type:G Protein-Coupled Receptor (GPCR)
Mol. Mass.:44716.46
Organism:Homo sapiens (Human)
Description:P29274
Residue:412
BDBM50108019
NameBDBM50108019
Synonyms:(5-(3-(5-amino-2-(furan-2-yl)-7H-pyrazolo[4,3-e][1,2,4]triazolo[1,5-c]pyrimidin-7-yl)propyl)benzo[d][1,3]dioxole-2,2-diyl)dimethanol {5-[3-(5-Amino-2-furan-2-yl-pyrazolo[4,3-e][1,2,4]triazolo[1,5-c]pyrimidin-7-yl)-propyl]-2-hydroxymethyl-benzo[1,3]dioxol-2-yl}-methanol
TypeSmall organic molecule
Emp. Form.C22H21N7O5
Mol. Mass.463.446
SMILESNc1nc2n(CCCc3ccc4OC(CO)(CO)Oc4c3)ncc2c2nc(nn12)-c1ccco1